�s�撬���R�[�h,NO,�s���{����,�s�撬����,����,����_�J�i,����_�p��,�Z��,����,�ݒu�ʒu,�ܓx,�o�x,�j���g�C������,�j���g�C�����i���֊�j,�j���g�C�����i�a���j,�j���g�C�����i�m���j,�����g�C������,�����g�C�����i�a���j,�����g�C�����i�m���j,�j�����p�g�C������,�j�����p�g�C�����i�a���j,�j�����p�g�C�����i�m���j,���@�\�g�C����,�Ԉ֎q�g�p�җp�g�C���L��,���c���p�ݔ��ݒu�g�C���L��,�I�X�g���C�g�ݒu�g�C���L��,���p�J�n����,���p�I������,���p�\���ԓ��L����,�摜,�摜_���C�Z���X,���l
132217,,�����s,�����s,�쉖�n��s���Z���^�[,�m�V�I�`�C�L�V�~���Z���^�[,,�쉖1-322-2,,,,,,,,,,,,,,,,�L,�L,�L,8:30,22:00,���j���E�N���N�n�͋x��,,,
132217,,�����s,�����s,������{�ۈ牀,�L���Z�W���E�O�E�z�C�N�G��,,�|�u3-8-1,,,,,0,0,0,0,0,0,0,0,0,0,0,��,��,��,9:00,17:00,�y�E���j���A�j���N���N�n�͋x��,,,�����₨�ނւ��̃X�y�[�X�u�Ԃ����E�ӂ���Ɓv�̂ݗ��p��
132217,,�����s,�����s,��������,�`���E�I�E�R�E�G��,,�~��1-1,,,,,,,,,,,,,,,,�L,�L,��,,,,,,
132217,,�����s,�����s,�����}����,�`���E�I�E�g�V���J��,,�~��1-1-21,,,,,,,,,,,,,,,,�L,�L,��,10:00,,�x�َ��Ԃ܂ŗ��p�B���j���E�j���E�ٓ��������Ȃǂ͋x��,,,
132217,,�����s,�����s,���R�n��s���Z���^�[,�}�c���}�`�C�L�V�~���Z���^�[,,���R2-6-25,,,,,,,,,,,,,,,,�L,�L,��,8:30,22:00,���j���E�N���N�n�͋x��,,,
132217,,�����s,�����s,�|�u�n��s���Z���^�[,�^�P�I�J�`�C�L�V�~���Z���^�[,,�|�u1-11-1,,,,,,,,,,,,,,,,�L,�L,��,8:30,22:00,���j���E�N���N�n�͋x��,,,
132217,,�����s,�����s,�q�ǂ��̔��B�x���E�𗬃Z���^�[,�R�h���m�n�b�^�c�V�G���E�R�E�����E�Z���^�[,,�|�u1-15-8,,,,,,,,,,,,,,,,�L,�L,�L,9:30,17:00,�y�E���j���A�j���N���N�n�͋x��,,,
132217,,�����s,�����s,�|�u�Βn����,�^�P�I�J�����N�`�R�E�G��,,�|�u2-7,,,,,,,,,,,,,,,,�L,�L,��,,,,,,
132217,,�����s,�����s,�|�u�Ȃ��悵����,�^�P�I�J�i�J���V�R�E�G��,,�|�u1-14,,,,,,,,,,,,,,,,�L,�L,��,,,,,,
132217,,�����s,�����s,���������炬����,�L���Z�Z�Z���M�R�E�G��,,����2-1471,,,,,,,,,,,,,,,,�L,�L,��,,,,,,
132217,,�����s,�����s,�����n��s���Z���^�[,�i�J�U�g�`�C�L�V�~���Z���^�[,,����4-1301,,,,,,,,,,,,,,,,�L,�L,�L,8:30,22:00,���j���E�N���N�n�͋x��,,,
132217,,�����s,�����s,������������,�i�J�U�g���i�Z�R�E�G��,,����4-1301,,,,,,,,,,,,,,,,�L,�L,��,,,,,,
132217,,�����s,�����s,�s�������Z���^�[,�V�~���J�c�h�E�Z���^�[,,�㐴��2-6-10,,,,,,,,,,,,,,,,�L,�L,��,9:00,17:30,���j���E�N���N�n���͋x��,,,
132217,,�����s,�����s,���y������,�L���E�h�n�N�u�c�J��,Kiyose City Museum,�㐴��2-6-41,,,,,,,,,,,,,,,,�L,�L,��,9:00,19:00,���j���E�N���N�n�͋x��,,,
132217,,�����s,�����s,�A�~���[,�A�~���[,,����1-2-11,4�`7�K,,,,,,,,,,,,,,,�L,�L,��,8:30,22:00,���j���E�N���N�n�͋x��,,,
132217,,�����s,�����s,�N���A,�N���A,,����1-4-5,,,,,,,,,,,,,,,,�L,�L,��,9:00,23:00,,,,
132217,,�����s,�����s,�������₫�z�[��,�L���Z�P���L�z�[��,Kiyose keyaki hall,����1-6-6,,,,,,,,,,,,,,,,�L,�L,�L,9:00,22:00,��3���j���E�N���N�n�͋x��,,,
132217,,�����s,�����s,������Z���^�[,�V���E�q�Z�C�J�c�Z���^�[,,����1-4-17,,,,,,,,,,,,,,,,�L,�L,��,9:00,22:00,���j���E�N���N�n�͋x��,,,
132217,,�����s,�����s,�����w������O�g�C��,�L���Z�G�L�~�i�~�O�`�R�E�V���E�g�C��,,���R1-2-4,,,,,,,,,,,,,,,,�L,�L,��,,,,,,
132217,,�����s,�����s,�������R�Βn����,�L���Z�J�i���}�����N�`�R�E�G��,,����4-650,,,,,,,,,,,,,,,,�L,�L,��,,,,,,
132217,,�����s,�����s,�����˒n��s���Z���^�[,�i�J�L���g�`�C�L�V�~���Z���^�[,,������4-847-5,,,,,,,,,,,,,,,,�L,�L,��,8:30,22:00,���j���E�N���N�n�͋x��,,,
132217,,�����s,�����s,�s����,�V���N�V��,�@Kiyose�@City�@office,����5-842,,,,,,,,,,,,,,,,��,�L,��,8:30,17:00,�y�E���j���A�j���A�N���N�n�͋x��,,,
132217,,�����s,�����s,���N�Z���^�[,�P���R�E�Z���^�[,,����5-842,,,,,,,,,,,,,,,,�L,�L,�L,8:30,17:00,,,,
132217,,�����s,�����s,�_�R����,�R�E���}�R�E�G��,,������3-235,,,,,,,,,,,,,,,,�L,�L,��,,,,,,
132217,,�����s,�����s,�����Z���^�[,�W�h�E�Z���^�[,,������3-235-5,,,,,,,,,,,,,,,,�L,�L,�L,9:00,22:00,�Ηj���E�N���N�n�͋x��,,,
132217,,�����s,�����s,���h�n��s���Z���^�[,�V�^�W���N�`�C�L�V�~���Z���^�[,,���h2-524-1,,,,,,,,,,,,,,,,�L,�L,�L,8:30,22:00,���j���E�N���N�n�͋x��,,,
132217,,�����s,�����s,�R�~���j�e�B�v���U�Ђ܂��,�R�~���j�e�B�v���U�q�}����,Community plaza HIMAWARI,������1-212-4,,,,,,,,,,,,,,,,�L,�L,��,9:00,22:00,���j���E�N���N�n�͋x��,,,
